BDBM50426813 CHEMBL2322778
SMILES NC(=O)c1ccc2-c3sc(cc3CCOc2c1)-c1ncnn1-c1ccc(F)cc1F
InChI Key InChIKey=UIQRHODPZSKEAJ-UHFFFAOYSA-N
Data  1 IC50
  Tab Delimited (TSV)   2D SDfile   Computed 3D by Vconf -m prep SDfile
Find this compound or compounds like it in BindingDB:
Activity Spreadsheet -- Enzyme Inhibition Constant Data from BindingDB
Found 1 hit for monomerid = 50426813
LigandPNGBDBM50426813(CHEMBL2322778)
Affinity DataIC50:  17nM. Assay description: Inhibition of PI3Kalpha-mediated AKT Ser 473 phosphorylation in human PC3 cells
In DepthDetails ArticlePubMed