BDBM50427049 CHEMBL2322829
SMILES O=C(Cc1ccc(cc1)-c1ccccc1)NCc1ccc(CN2CCCC2)cc1
InChI Key InChIKey=YUXNQCGWTHODOD-UHFFFAOYSA-N
Data  1 IC50
  Tab Delimited (TSV)   2D SDfile   Computed 3D by Vconf -m prep SDfile
Find this compound or compounds like it in BindingDB:
Activity Spreadsheet -- Enzyme Inhibition Constant Data from BindingDB
Found 1 hit for monomerid = 50427049
TargetBeta-secretase 1(Homo sapiens (Human))
University Of Leeds
Curated by ChEMBL
LigandPNGBDBM50427049(CHEMBL2322829)
Affinity DataIC50: >1.00E+5nM. Assay description: Inhibition of recombinant BACE1 (unknown origin) using FAM-SEVNLDAEFK-TAMRA as substrate incubated for 30 mins prior to substrate addition by fluorim...
In DepthDetails ArticlePubMed