BDBM50427051 CHEMBL2322534
SMILES NCc1ccc(CNC(=O)Cc2ccc(c(O)c2)-c2ccccc2)cc1
InChI Key InChIKey=YBFFVTBHXBBXJD-UHFFFAOYSA-N
Data  1 IC50
  Tab Delimited (TSV)   2D SDfile   Computed 3D by Vconf -m prep SDfile
Find this compound or compounds like it in BindingDB:
Activity Spreadsheet -- Enzyme Inhibition Constant Data from BindingDB
Found 1 hit for monomerid = 50427051
TargetBeta-secretase 1(Homo sapiens (Human))
University Of Leeds
Curated by ChEMBL
LigandPNGBDBM50427051(CHEMBL2322534)
Affinity DataIC50: >1.00E+5nM. Assay description: Inhibition of recombinant BACE1 (unknown origin) using FAM-SEVNLDAEFK-TAMRA as substrate incubated for 30 mins prior to substrate addition by fluorim...
In DepthDetails ArticlePubMed