BDBM50427404 CHEMBL2326308
SMILES CCN(CC)c1ccc(CN([C@]23C[C@H]4C[C@H](C[C@H](C4)C2)C3)S(=O)(=O)c2ccc(Cl)cc2)cc1
InChI Key InChIKey=QVGAPTFMIRGGIO-KRPBIIQHSA-N
Data  2 KI
  Tab Delimited (TSV)   2D SDfile   Computed 3D by Vconf -m prep SDfile
Find this compound or compounds like it in BindingDB:
Activity Spreadsheet -- Enzyme Inhibition Constant Data from BindingDB
Found 2 hits for monomerid = 50427404
TargetCannabinoid receptor 2(Homo sapiens (Human))
University Of Pittsburgh
Curated by ChEMBL
LigandPNGBDBM50427404(CHEMBL2326308)
Affinity DataKi:  173nM. Assay description: Displacement of [3H]CP-55,940 from CB2 receptor (unknown origin) after 1 hr by scintillation counting analysis
In DepthDetails ArticlePubMed
TargetCannabinoid receptor 1(Homo sapiens (Human))
University Of Pittsburgh
Curated by ChEMBL
LigandPNGBDBM50427404(CHEMBL2326308)
Affinity DataKi:  2.03E+3nM. Assay description: Displacement of [3H]CP-55,940 from CB1 receptor (unknown origin) after 1 hr by scintillation counting analysis
In DepthDetails ArticlePubMed