BDBM50427516 CHEMBL2322266
SMILES CC(=O)Nc1ccc(NC(=O)CCc2c(C)c3cc4c5CCCCc5oc4c(C)c3oc2=O)cc1
InChI Key InChIKey=ANYGOYRHZSCXCH-UHFFFAOYSA-N
Data  1 EC50
  Tab Delimited (TSV)   2D SDfile   Computed 3D by Vconf -m prep SDfile
Find this compound or compounds like it in BindingDB:
Activity Spreadsheet -- Enzyme Inhibition Constant Data from BindingDB
Found 1 hit for monomerid = 50427516
TargetNuclear factor NF-kappa-B p105 subunit(Homo sapiens (Human))
Universit£
Curated by ChEMBL
LigandPNGBDBM50427516(CHEMBL2322266)
Affinity DataEC50:  1.00E+6nM. Assay description: Inhibition of human NF-kappaB p50/DNA interaction using 32P-labeled oligonucleotides as substrate preincubated for 20 mins before substrate addition ...
In DepthDetails ArticlePubMed