BDBM50429176 CHEMBL2336717
SMILES ONC(=O)CC12CC3CC(C1)CC(C3)(C2)c1ccc(cc1[N+]([O-])=O)[N+]([O-])=O
InChI Key InChIKey=FKKNUDQXXSMJHE-UHFFFAOYSA-N
Data  1 IC50
  Tab Delimited (TSV)   2D SDfile   Computed 3D by Vconf -m prep SDfile
Find this compound or compounds like it in BindingDB:
Activity Spreadsheet -- Enzyme Inhibition Constant Data from BindingDB
Found 1 hit for monomerid = 50429176
TargetBotulinum neurotoxin type A(Clostridium botulinum)
The Scripps Research Institute
Curated by ChEMBL
LigandPNGBDBM50429176(CHEMBL2336717)
Affinity DataIC50:  400nM. Assay description: Inhibition of Clostridium botulinum BoNT/A Hall A hyper protease light chain (1-425aa) using SNAPtide as substrate by FRET assay
In DepthDetails ArticlePubMed