BDBM50429428 CHEMBL2338578
SMILES Cc1cccc(n1)C(=O)N[C@@H]1CCC[C@@]2(CN=C(O2)c2cccc(Cl)c2)C1
InChI Key InChIKey=JUFSRROJKRHALC-UTKZUKDTSA-N
Data  2 IC50
  Tab Delimited (TSV)   2D SDfile   Computed 3D by Vconf -m prep SDfile
Find this compound or compounds like it in BindingDB:
Activity Spreadsheet -- Enzyme Inhibition Constant Data from BindingDB
Found 2 hits for monomerid = 50429428
TargetMetabotropic glutamate receptor 5(Homo sapiens (Human))
Lundbeck Research Usa
Curated by ChEMBL
LigandPNGBDBM50429428(CHEMBL2338578)
Affinity DataIC50:  5.22E+3nM. Assay description: Antagonist activity at human mGluR5 expressed in HEK293 cells assessed as inhibition of Ca2+ mobilization by FLIPR assay
In DepthDetails ArticlePubMed
TargetMetabotropic glutamate receptor 5(Homo sapiens (Human))
Lundbeck Research Usa
Curated by ChEMBL
LigandPNGBDBM50429428(CHEMBL2338578)
Affinity DataIC50:  5.23E+3nM. Assay description: Antagonist activity at human mGluR5 expressed in HEK293 cells assessed as inhibition of Ca2+ mobilization by FLIPR assay
In DepthDetails ArticlePubMed