BDBM50429769 CHEMBL2336340
SMILES Oc1ccc(NC(=O)\C=C\c2ccc(O)cc2)cc1
InChI Key InChIKey=MNOXESDMWKOCBB-XCVCLJGOSA-N
Data  3 IC50
  Tab Delimited (TSV)   2D SDfile   Computed 3D by Vconf -m prep SDfile
Find this compound or compounds like it in BindingDB:
Activity Spreadsheet -- Enzyme Inhibition Constant Data from BindingDB
Found 3 hits for monomerid = 50429769
Target72 kDa type IV collagenase(Homo sapiens (Human))
Nanjing University Of Chinese Medicine
Curated by ChEMBL
LigandPNGBDBM50429769(CHEMBL2336340)
Affinity DataIC50:  4nM. Assay description: Inhibition of human recombinant MMP2 using succinylated gelatin as substrate incubated for 30 mins prior to substrate addition measured after 60 mins
In DepthDetails ArticlePubMed
TargetInterstitial collagenase(Homo sapiens (Human))
Nanjing University Of Chinese Medicine
Curated by ChEMBL
LigandPNGBDBM50429769(CHEMBL2336340)
Affinity DataIC50:  5.52E+3nM. Assay description: Inhibition of human recombinant MMP1 using succinylated gelatin as substrate incubated for 30 mins prior to substrate addition measured after 60 mins
In DepthDetails ArticlePubMed
TargetMatrix metalloproteinase-9(Homo sapiens (Human))
Nanjing University Of Chinese Medicine
Curated by ChEMBL
LigandPNGBDBM50429769(CHEMBL2336340)
Affinity DataIC50:  4.30nM. Assay description: Inhibition of human recombinant MMP9 using succinylated gelatin as substrate incubated for 30 mins prior to substrate addition measured after 60 mins
In DepthDetails ArticlePubMed