BDBM50430096 CHEMBL2337739
SMILES COc1cc(ccc1OCCN1CCCC1)N1Cc2ccc(Cc3cccc(F)c3)nc2C1=O
InChI Key InChIKey=GAAMNPMSLIHUDL-UHFFFAOYSA-N
Data  1 IC50
  Tab Delimited (TSV)   2D SDfile   Computed 3D by Vconf -m prep SDfile
Find this compound or compounds like it in BindingDB:
Activity Spreadsheet -- Enzyme Inhibition Constant Data from BindingDB
Found 1 hit for monomerid = 50430096
TargetMelanin-concentrating hormone receptor 1(Homo sapiens (Human))
Korea Research Institute Of Chemical Technology
Curated by ChEMBL
LigandPNGBDBM50430096(CHEMBL2337739)
Affinity DataIC50:  410nM. Assay description: Displacement of Eu-MCH from human MCHR1 expressed in CHO cell membranes by TRF assay
In DepthDetails ArticlePubMed