BDBM50430111 CHEMBL2337747
SMILES COc1cc(ccc1OCCN1CCCC1)N1Cc2ccc(nc2C1=O)-c1ccc(cc1)C#N
InChI Key InChIKey=ZDQFIIDVKMVKFF-UHFFFAOYSA-N
Data  1 IC50
  Tab Delimited (TSV)   2D SDfile   Computed 3D by Vconf -m prep SDfile
Find this compound or compounds like it in BindingDB:
Activity Spreadsheet -- Enzyme Inhibition Constant Data from BindingDB
Found 1 hit for monomerid = 50430111
TargetMelanin-concentrating hormone receptor 1(Homo sapiens (Human))
Korea Research Institute Of Chemical Technology
Curated by ChEMBL
LigandPNGBDBM50430111(CHEMBL2337747)
Affinity DataIC50:  1.00E+4nM. Assay description: Displacement of Eu-MCH from human MCHR1 expressed in CHO cell membranes by TRF assay
In DepthDetails ArticlePubMed