BDBM50430119 CHEMBL2337756
SMILES COc1cccc(c1)-c1ccc2CN(C(=O)c2n1)c1ccc(OCCN2CCCC2)c(OC)c1
InChI Key InChIKey=QTORSCZTNDMGIF-UHFFFAOYSA-N
Data  1 IC50
  Tab Delimited (TSV)   2D SDfile   Computed 3D by Vconf -m prep SDfile
Find this compound or compounds like it in BindingDB:
Activity Spreadsheet -- Enzyme Inhibition Constant Data from BindingDB
Found 1 hit for monomerid = 50430119
TargetMelanin-concentrating hormone receptor 1(Homo sapiens (Human))
Korea Research Institute Of Chemical Technology
Curated by ChEMBL
LigandPNGBDBM50430119(CHEMBL2337756)
Affinity DataIC50:  2.01E+3nM. Assay description: Displacement of Eu-MCH from human MCHR1 expressed in CHO cell membranes by TRF assay
In DepthDetails ArticlePubMed