BDBM50430127 CHEMBL2337728
SMILES COc1ccc(Sc2ccc3CN(C(=O)c3n2)c2ccc(OCCN3CCCC3)c(OC)c2)cc1
InChI Key InChIKey=WTJDUFFBUPWNBS-UHFFFAOYSA-N
Data  1 IC50
  Tab Delimited (TSV)   2D SDfile   Computed 3D by Vconf -m prep SDfile
Find this compound or compounds like it in BindingDB:
Activity Spreadsheet -- Enzyme Inhibition Constant Data from BindingDB
Found 1 hit for monomerid = 50430127
TargetMelanin-concentrating hormone receptor 1(Homo sapiens (Human))
Korea Research Institute Of Chemical Technology
Curated by ChEMBL
LigandPNGBDBM50430127(CHEMBL2337728)
Affinity DataIC50:  100nM. Assay description: Displacement of Eu-MCH from human MCHR1 expressed in CHO cell membranes by TRF assay
In DepthDetails ArticlePubMed