BDBM50430826 CHEMBL2335155
SMILES Cc1noc(C)c1-c1ccc2ncn(Cc3ccc(cc3)C#N)c2c1
InChI Key InChIKey=MLWRFWIMTXIJLC-UHFFFAOYSA-N
Data  3 IC50
  Tab Delimited (TSV)   2D SDfile   Computed 3D by Vconf -m prep SDfile
Find this compound or compounds like it in BindingDB:
Activity Spreadsheet -- Enzyme Inhibition Constant Data from BindingDB
Found 3 hits for monomerid = 50430826
TargetBromodomain-containing protein 4(Homo sapiens (Human))
University Of Oxford
Curated by ChEMBL
LigandPNGBDBM50430826(CHEMBL2335155)
Affinity DataIC50:  180nM. Assay description: Binding affinity to human BRD4 bromodomain 1 using H4Ac4 peptide by amplified luminescent proximity homogeneous assay
In DepthDetails ArticlePubMed
TargetBromodomain-containing protein 4(Homo sapiens (Human))
University Of Oxford
Curated by ChEMBL
LigandPNGBDBM50430826(CHEMBL2335155)
Affinity DataIC50:  200nM. Assay description: Inhibition of BRD4 bromodomain-1 (unknown origin) by AlphaScreen assay
In DepthDetails ArticlePubMed
TargetBromodomain-containing protein 4(Homo sapiens (Human))
University Of Oxford
Curated by ChEMBL
LigandPNGBDBM50430826(CHEMBL2335155)
Affinity DataIC50:  199nM. Assay description: Inhibition of BRD4 bromodomain-1 (unknown origin) by AlphaScreen assay
In DepthDetails ArticlePubMed