BDBM50431187 CHEMBL2332588
SMILES Cc1cc(O)ccc1-c1cocc1-c1ccc(O)cc1C
InChI Key InChIKey=WGXQWLJYBOWUIR-UHFFFAOYSA-N
Data  2 EC50
  Tab Delimited (TSV)   2D SDfile   Computed 3D by Vconf -m prep SDfile
Find this compound or compounds like it in BindingDB:
Activity Spreadsheet -- Enzyme Inhibition Constant Data from BindingDB
Found 2 hits for monomerid = 50431187
TargetEstrogen receptor(Homo sapiens (Human))
Key Laboratory Of Combinatorial Biosynthesis And Drug Discovery (Wuhan University)
Curated by ChEMBL
LigandPNGBDBM50431187(CHEMBL2332588)
Affinity DataEC50:  944nM. Assay description: Agonist activity at estrogen receptor alpha (unknown origin) expressed in human HepG2 cells coexpressing estrogen response element after 24 hrs by lu...
In DepthDetails ArticlePubMed
TargetEstrogen receptor beta(Homo sapiens (Human))
Key Laboratory Of Combinatorial Biosynthesis And Drug Discovery (Wuhan University)
Curated by ChEMBL
LigandPNGBDBM50431187(CHEMBL2332588)
Affinity DataEC50:  5.11E+3nM. Assay description: Agonist activity at estrogen receptor beta (unknown origin) expressed in human HepG2 cells coexpressing estrogen response element after 24 hrs by luc...
In DepthDetails ArticlePubMed