BDBM50431205 CHEMBL2332587
SMILES Oc1ccc(cc1)-c1cocc1-c1ccc(O)cc1
InChI Key InChIKey=LIZFFBQEILHNIX-UHFFFAOYSA-N
Data  1 EC50
  Tab Delimited (TSV)   2D SDfile   Computed 3D by Vconf -m prep SDfile
Find this compound or compounds like it in BindingDB:
Activity Spreadsheet -- Enzyme Inhibition Constant Data from BindingDB
Found 1 hit for monomerid = 50431205
TargetEstrogen receptor(Homo sapiens (Human))
Key Laboratory Of Combinatorial Biosynthesis And Drug Discovery (Wuhan University)
Curated by ChEMBL
LigandPNGBDBM50431205(CHEMBL2332587)
Affinity DataEC50:  1.06E+4nM. Assay description: Agonist activity at estrogen receptor alpha (unknown origin) expressed in human HepG2 cells coexpressing estrogen response element after 24 hrs by lu...
In DepthDetails ArticlePubMed