BDBM50431250 CHEMBL2333058
SMILES CCCCCNC(=O)n1ccc(=O)[nH]c1=O
InChI Key InChIKey=GNPSKUBDWAAFCZ-UHFFFAOYSA-N
Data  1 IC50
  Tab Delimited (TSV)   2D SDfile   Computed 3D by Vconf -m prep SDfile
Find this compound or compounds like it in BindingDB:
Activity Spreadsheet -- Enzyme Inhibition Constant Data from BindingDB
Found 1 hit for monomerid = 50431250
TargetAcid ceramidase(Rattus norvegicus (Rat))
Fondazione Istituto Italiano Di Tecnologia
Curated by ChEMBL
LigandPNGBDBM50431250(CHEMBL2333058)
Affinity DataIC50:  2.10E+3nM. Assay description: Inhibition of rat recombinant acid ceramidase expressed in human HEK293 cells using N-lauroylceramide as substrate incubated for 30 mins prior to sub...
In DepthDetails ArticlePubMed