BDBM50431256 CHEMBL2333052
SMILES CCCCCCNC(=O)n1cc(F)c(=O)n(C(=O)C(C)C)c1=O
InChI Key InChIKey=HNHMKHUFPLLTMR-UHFFFAOYSA-N
Data  1 IC50
  Tab Delimited (TSV)   2D SDfile   Computed 3D by Vconf -m prep SDfile
Find this compound or compounds like it in BindingDB:
Activity Spreadsheet -- Enzyme Inhibition Constant Data from BindingDB
Found 1 hit for monomerid = 50431256
TargetAcid ceramidase(Rattus norvegicus (Rat))
Fondazione Istituto Italiano Di Tecnologia
Curated by ChEMBL
LigandPNGBDBM50431256(CHEMBL2333052)
Affinity DataIC50:  21nM. Assay description: Inhibition of rat recombinant acid ceramidase expressed in human HEK293 cells using N-lauroylceramide as substrate incubated for 30 mins prior to sub...
In DepthDetails ArticlePubMed