BDBM50431845 CHEMBL2347607
SMILES CNC(=O)[C@H](N1CCn2c(nc(Cl)c2[C@@H]1CCc1ccc(cc1)C(F)(F)F)C1CC1)c1ccccc1
InChI Key InChIKey=RHRCOGXSJYWCBK-FCHUYYIVSA-N
Data  4 IC50
  Tab Delimited (TSV)   2D SDfile   Computed 3D by Vconf -m prep SDfile
Find this compound or compounds like it in BindingDB:
Activity Spreadsheet -- Enzyme Inhibition Constant Data from BindingDB
Found 4 hits for monomerid = 50431845
TargetOrexin/Hypocretin receptor type 1(Homo sapiens (Human))
Actelion Pharmaceuticals
Curated by ChEMBL
LigandPNGBDBM50431845(CHEMBL2347607)
Affinity DataIC50:  31nM. Assay description: Antagonist activity at human OX1 receptor expressed in CHO cells assessed as inhibition of orexin A-induced calcium influx by FLIPR assay
In DepthDetails ArticlePubMed
TargetOrexin/Hypocretin receptor type 1(Homo sapiens (Human))
Actelion Pharmaceuticals
Curated by ChEMBL
LigandPNGBDBM50431845(CHEMBL2347607)
Affinity DataIC50:  30nM. Assay description: Antagonist activity at human OX1R expressed in CHO cells assessed as inhibition of calcium mobilization by FLIPR assay
In DepthDetails ArticlePubMed
TargetOrexin receptor type 2(Homo sapiens (Human))
Actelion Pharmaceuticals
Curated by ChEMBL
LigandPNGBDBM50431845(CHEMBL2347607)
Affinity DataIC50:  9nM. Assay description: Antagonist activity at human OX2R expressed in CHO cells assessed as inhibition of calcium mobilization by FLIPR assay
In DepthDetails ArticlePubMed
TargetOrexin receptor type 2(Homo sapiens (Human))
Actelion Pharmaceuticals
Curated by ChEMBL
LigandPNGBDBM50431845(CHEMBL2347607)
Affinity DataIC50:  9nM. Assay description: Antagonist activity at human OX2 receptor expressed in CHO cells assessed as inhibition of orexin A-induced calcium influx by FLIPR assay
In DepthDetails ArticlePubMed