BDBM50431865 CHEMBL2347477
SMILES CCCc1nc(CC)n2CCN([C@@H](C(=O)NC)c3ccccc3)C(CCc3ccc(cc3)C(F)(F)F)c12
InChI Key InChIKey=UCHOFKCDLMZEAO-JUERFOTFSA-N
Data  2 IC50
  Tab Delimited (TSV)   2D SDfile   Computed 3D by Vconf -m prep SDfile
Find this compound or compounds like it in BindingDB:
Activity Spreadsheet -- Enzyme Inhibition Constant Data from BindingDB
Found 2 hits for monomerid = 50431865
TargetOrexin receptor type 2(Homo sapiens (Human))
Actelion Pharmaceuticals
Curated by ChEMBL
LigandPNGBDBM50431865(CHEMBL2347477)
Affinity DataIC50:  225nM. Assay description: Antagonist activity at human OX2 receptor expressed in CHO cells assessed as inhibition of orexin A-induced calcium influx by FLIPR assay
In DepthDetails ArticlePubMed
TargetOrexin/Hypocretin receptor type 1(Homo sapiens (Human))
Actelion Pharmaceuticals
Curated by ChEMBL
LigandPNGBDBM50431865(CHEMBL2347477)
Affinity DataIC50:  1.00E+4nM. Assay description: Antagonist activity at human OX1 receptor expressed in CHO cells assessed as inhibition of orexin A-induced calcium influx by FLIPR assay
In DepthDetails ArticlePubMed