BDBM50431869 CHEMBL2347608
SMILES CNC(=O)[C@H](N1CCn2c(CC3CC3)nc(Cl)c2[C@@H]1CCc1ccc(cc1)C(F)(F)F)c1ccccc1
InChI Key InChIKey=LPTIYNOSMVKYRM-LADGPHEKSA-N
Data  2 IC50
  Tab Delimited (TSV)   2D SDfile   Computed 3D by Vconf -m prep SDfile
Find this compound or compounds like it in BindingDB:
Activity Spreadsheet -- Enzyme Inhibition Constant Data from BindingDB
Found 2 hits for monomerid = 50431869
TargetOrexin/Hypocretin receptor type 1(Homo sapiens (Human))
Actelion Pharmaceuticals
Curated by ChEMBL
LigandPNGBDBM50431869(CHEMBL2347608)
Affinity DataIC50:  1.43E+3nM. Assay description: Antagonist activity at human OX1 receptor expressed in CHO cells assessed as inhibition of orexin A-induced calcium influx by FLIPR assay
In DepthDetails ArticlePubMed
TargetOrexin receptor type 2(Homo sapiens (Human))
Actelion Pharmaceuticals
Curated by ChEMBL
LigandPNGBDBM50431869(CHEMBL2347608)
Affinity DataIC50:  35nM. Assay description: Antagonist activity at human OX2 receptor expressed in CHO cells assessed as inhibition of orexin A-induced calcium influx by FLIPR assay
In DepthDetails ArticlePubMed