BDBM50431883 REL-DEHYDROEURYSPONGIN A
SMILES CC1=C[C@@H]2CC(C)(C)[C@H]1\C=C/c1ccoc21
InChI Key InChIKey=DLJMTCDCFXWRNP-CIUCYMIDSA-N
Data  2 IC50
  Tab Delimited (TSV)   2D SDfile   Computed 3D by Vconf -m prep SDfile
Find this compound or compounds like it in BindingDB:
Activity Spreadsheet -- Enzyme Inhibition Constant Data from BindingDB
Found 2 hits for monomerid = 50431883
TargetTyrosine-protein phosphatase non-receptor type 1(Homo sapiens (Human))
Tohoku Pharmaceutical University
Curated by ChEMBL
LigandPNGBDBM50431883(REL-DEHYDROEURYSPONGIN A)
Affinity DataIC50:  3.60E+3nM. Assay description: Inhibition of PTP1B (unknown origin)
Ligand InfoPC cidPC sid
In DepthDetails ArticlePubMed
TargetTyrosine-protein phosphatase non-receptor type 1(Homo sapiens (Human))
Tohoku Pharmaceutical University
Curated by ChEMBL
LigandPNGBDBM50431883(REL-DEHYDROEURYSPONGIN A)
Affinity DataIC50:  3.58E+3nM. Assay description: Inhibition of PTP1B (unknown origin) using pNPP as substrate incubated for 10 mins prior to substrate addition measured after 30 mins by microplate r...
Ligand InfoPC cidPC sid
In DepthDetails ArticlePubMed