BDBM50432176 CHEMBL2346799
SMILES CC1(C)Cc2cc(Cl)ccc2C(N[C@@H](Cc2ccccc2)c2nc3ccccc3c(=O)[nH]2)=N1
InChI Key InChIKey=PAZUNXAAGDUPAQ-QHCPKHFHSA-N
Data  1 IC50
  Tab Delimited (TSV)   2D SDfile   Computed 3D by Vconf -m prep SDfile
Find this compound or compounds like it in BindingDB:
Activity Spreadsheet -- Enzyme Inhibition Constant Data from BindingDB
Found 1 hit for monomerid = 50432176
TargetBeta-secretase 1(Homo sapiens (Human))
Elan Pharmaceuticals
Curated by ChEMBL
LigandPNGBDBM50432176(CHEMBL2346799)
Affinity DataIC50:  7.23E+3nM. Assay description: Inhibition of BACE-1 (unknown origin) by alpha screen assay
In DepthDetails ArticlePubMed