BDBM50432184 CHEMBL2346791
SMILES CC1(C)Cc2ccccc2C(NC(Cc2ccccc2)c2nnn[nH]2)=N1
InChI Key InChIKey=HWQBHEXYOVDZOR-UHFFFAOYSA-N
Data  1 IC50
  Tab Delimited (TSV)   2D SDfile   Computed 3D by Vconf -m prep SDfile
Find this compound or compounds like it in BindingDB:
Activity Spreadsheet -- Enzyme Inhibition Constant Data from BindingDB
Found 1 hit for monomerid = 50432184
TargetBeta-secretase 1(Homo sapiens (Human))
Elan Pharmaceuticals
Curated by ChEMBL
LigandPNGBDBM50432184(CHEMBL2346791)
Affinity DataIC50:  6.39E+5nM. Assay description: Inhibition of BACE-1 (unknown origin) by alpha screen assay
In DepthDetails ArticlePubMed