BDBM50432185 CHEMBL2346790
SMILES CC1(C)Cc2cc(Cl)ccc2C(N[C@@H](Cc2ccccc2)C(O)=O)=N1
InChI Key InChIKey=MRUPOSGQIWSVEY-KRWDZBQOSA-N
Data  1 IC50
  Tab Delimited (TSV)   2D SDfile   Computed 3D by Vconf -m prep SDfile
Find this compound or compounds like it in BindingDB:
Activity Spreadsheet -- Enzyme Inhibition Constant Data from BindingDB
Found 1 hit for monomerid = 50432185
TargetBeta-secretase 1(Homo sapiens (Human))
Elan Pharmaceuticals
Curated by ChEMBL
LigandPNGBDBM50432185(CHEMBL2346790)
Affinity DataIC50:  2.84E+3nM. Assay description: Inhibition of BACE-1 (unknown origin) by alpha screen assay
In DepthDetails ArticlePubMed