BDBM50432282 CHEMBL2347670
SMILES CS(=O)(=O)c1nc(c([nH]1)-c1ccc(cc1)S(C)(=O)=O)-c1ccc(Cl)cc1
InChI Key InChIKey=LJDAHEPYRINDLT-UHFFFAOYSA-N
Data  2 IC50
  Tab Delimited (TSV)   2D SDfile   Computed 3D by Vconf -m prep SDfile
Find this compound or compounds like it in BindingDB:
Activity Spreadsheet -- Enzyme Inhibition Constant Data from BindingDB
Found 2 hits for monomerid = 50432282
TargetProstaglandin G/H synthase 1(Homo sapiens (Human))
Tehran University Of Medical Sciences
Curated by ChEMBL
LigandPNGBDBM50432282(CHEMBL2347670)
Affinity DataIC50:  420nM. Assay description: Inhibition of COX1 in human blood assessed as PGE2 level incubated for 15 mins prior to LPS-challenge measured after 24 hrs by enzyme immunoassay
In DepthDetails ArticlePubMed
TargetProstaglandin G/H synthase 2(Homo sapiens (Human))
Tehran University Of Medical Sciences
Curated by ChEMBL
LigandPNGBDBM50432282(CHEMBL2347670)
Affinity DataIC50:  310nM. Assay description: Inhibition of COX2 in human blood assessed as TxB2 level after 1 hr by enzyme immunoassay
In DepthDetails ArticlePubMed