BDBM50433011 CHEMBL2375930
SMILES CN1CCN(CCC(=O)Nc2ccc3nc4c5[nH]c6ccccc6c5ccn4c(=O)c3c2)CC1
InChI Key InChIKey=KMGINLONUJGCOO-UHFFFAOYSA-N
Data  2 IC50
  Tab Delimited (TSV)   2D SDfile   Computed 3D by Vconf -m prep SDfile
Find this compound or compounds like it in BindingDB:
Activity Spreadsheet -- Enzyme Inhibition Constant Data from BindingDB
Found 2 hits for monomerid = 50433011
TargetAcetylcholinesterase(Electrophorus electricus (Electric eel))
Sun Yat-Sen University
Curated by ChEMBL
LigandPNGBDBM50433011(CHEMBL2375930)
Affinity DataIC50:  141nM. Assay description: Inhibition of electric eel acetylcholinesterase using acetylthiocholine as substrate incubated for 15 mins followed by substrate addition measured fo...
In DepthDetails ArticlePubMed
TargetCholinesterase(Equus caballus (Horse))
Sun Yat-Sen University
Curated by ChEMBL
LigandPNGBDBM50433011(CHEMBL2375930)
Affinity DataIC50:  2.89E+4nM. Assay description: Inhibition of horse serum butyrylcholinesterase using butylthiocholine as substrate incubated for 15 mins followed by substrate addition measured for...
In DepthDetails ArticlePubMed