BDBM50433072 CHEMBL2376126
SMILES Cc1nc(N=Nc2cc(ccc2S(O)(=O)=O)S(O)(=O)=O)c(CCC(O)=O)c(C=O)c1O
InChI Key InChIKey=DRLAZBVZFMPCLR-UHFFFAOYSA-N
Data  2 IC50
  Tab Delimited (TSV)   2D SDfile   Computed 3D by Vconf -m prep SDfile
Find this compound or compounds like it in BindingDB:
Activity Spreadsheet -- Enzyme Inhibition Constant Data from BindingDB
Found 2 hits for monomerid = 50433072
TargetP2X purinoceptor 1(Mus musculus)
Gwangju Institute Of Science And Technology
Curated by ChEMBL
LigandPNGBDBM50433072(CHEMBL2376126)
Affinity DataIC50:  71nM. Assay description: Antagonist activity at mouse recombinant P2X1 receptor expressed in Xenopus oocytes assessed as inhibition of ATP-induced ion current incubated for 2...
In DepthDetails ArticlePubMed
TargetP2X purinoceptor 3(Homo sapiens (Human))
Gwangju Institute Of Science And Technology
Curated by ChEMBL
LigandPNGBDBM50433072(CHEMBL2376126)
Affinity DataIC50:  106nM. Assay description: Antagonist activity at human recombinant P2X3 receptor expressed in Xenopus oocytes assessed as inhibition of ATP-induced ion current incubated for 2...
In DepthDetails ArticlePubMed