BDBM50434203 CHEMBL2385459
SMILES COc1ccc(F)c(c1)-c1ccc(COc2ccc3C[C@]4(C[C@H]4C(O)=O)c3c2)cc1C1=CCCC1(C)C
InChI Key InChIKey=PPQRNISGBBLFIJ-IUDBTDONSA-N
Data  1 EC50
  Tab Delimited (TSV)   2D SDfile   Computed 3D by Vconf -m prep SDfile
Find this compound or compounds like it in BindingDB:
Activity Spreadsheet -- Enzyme Inhibition Constant Data from BindingDB
Found 1 hit for monomerid = 50434203
TargetFree fatty acid receptor 1(Homo sapiens (Human))
Amgen
Curated by ChEMBL
LigandPNGBDBM50434203(CHEMBL2385459)
Affinity DataEC50:  820nM. Assay description: Agonist activity at human FFA1 receptor expressed in CHO cell membranes after 4 hrs by aequorin bioluminescence assay
In DepthDetails ArticlePubMed