BDBM50435531 CHEMBL2392779
SMILES Cc1cncn1CCCNC(=S)Nc1ccc2cccnc2c1
InChI Key InChIKey=RQAFGGGBYCABKL-UHFFFAOYSA-N
Data  1 IC50
  Tab Delimited (TSV)   2D SDfile   Computed 3D by Vconf -m prep SDfile
Find this compound or compounds like it in BindingDB:
Activity Spreadsheet -- Enzyme Inhibition Constant Data from BindingDB
Found 1 hit for monomerid = 50435531
TargetGlutaminyl-peptide cyclotransferase(Homo sapiens (Human))
Seoul National University
Curated by ChEMBL
LigandPNGBDBM50435531(CHEMBL2392779)
Affinity DataIC50:  768nM. Assay description: Inhibition of human glutaminyl cyclase expressed in HEK293 cells using L-glutaminyl-beta-naphthylamine as substrate after 1 hr by fluorometric analys...
In DepthDetails ArticlePubMed