BDBM50435543 CHEMBL2392807
SMILES Cc1cncn1CCCNC(=S)Nc1ccc2ncn(C)c2c1
InChI Key InChIKey=KHJNVGSPCCMOEH-UHFFFAOYSA-N
Data  1 IC50
  Tab Delimited (TSV)   2D SDfile   Computed 3D by Vconf -m prep SDfile
Find this compound or compounds like it in BindingDB:
Activity Spreadsheet -- Enzyme Inhibition Constant Data from BindingDB
Found 1 hit for monomerid = 50435543
TargetGlutaminyl-peptide cyclotransferase(Homo sapiens (Human))
Seoul National University
Curated by ChEMBL
LigandPNGBDBM50435543(CHEMBL2392807)
Affinity DataIC50:  461nM. Assay description: Inhibition of human glutaminyl cyclase expressed in HEK293 cells using L-glutaminyl-beta-naphthylamine as substrate after 1 hr by fluorometric analys...
In DepthDetails ArticlePubMed