BDBM50435552 CHEMBL2392797
SMILES Cc1cncn1CCCNC(=S)Nc1ccc2CCCC(=O)c2c1
InChI Key InChIKey=BBLKWRXKZDIBAD-UHFFFAOYSA-N
Data  1 IC50
  Tab Delimited (TSV)   2D SDfile   Computed 3D by Vconf -m prep SDfile
Find this compound or compounds like it in BindingDB:
Activity Spreadsheet -- Enzyme Inhibition Constant Data from BindingDB
Found 1 hit for monomerid = 50435552
TargetGlutaminyl-peptide cyclotransferase(Homo sapiens (Human))
Seoul National University
Curated by ChEMBL
LigandPNGBDBM50435552(CHEMBL2392797)
Affinity DataIC50:  788nM. Assay description: Inhibition of human glutaminyl cyclase expressed in HEK293 cells using L-glutaminyl-beta-naphthylamine as substrate after 1 hr by fluorometric analys...
In DepthDetails ArticlePubMed