BDBM50435587 CHEMBL2393510
SMILES OC1(CCN(CC1)C(=O)COc1cc(=O)oc2ccccc12)c1ccc(Br)cc1
InChI Key InChIKey=SFCUHNJETIBXQM-UHFFFAOYSA-N
Data  2 IC50
  Tab Delimited (TSV)   2D SDfile   Computed 3D by Vconf -m prep SDfile
Find this compound or compounds like it in BindingDB:
Activity Spreadsheet -- Enzyme Inhibition Constant Data from BindingDB
Found 2 hits for monomerid = 50435587
TargetAcetylcholinesterase(Electrophorus electricus (Electric eel))
University Of Zanjan
Curated by ChEMBL
LigandPNGBDBM50435587(CHEMBL2393510)
Affinity DataIC50: >1.00E+5nM. Assay description: Inhibition of electric eel AChE using acetylthiocholine iodide as substrate preincubated for 10 mins prior to substrate addition by Ellman's method
In DepthDetails ArticlePubMed
TargetCholinesterase(Equus caballus (Horse))
University Of Zanjan
Curated by ChEMBL
LigandPNGBDBM50435587(CHEMBL2393510)
Affinity DataIC50: >1.00E+5nM. Assay description: Inhibition of equine serum BChE using butylthiocholine iodide as substrate preincubated for 10 mins prior to substrate addition by Ellman's method
In DepthDetails ArticlePubMed