BDBM50435647 CHEMBL2391434
SMILES Cc1cc(C(=O)NC(C)(C)C)c(C#N)c(Oc2cccc(NS(=O)(=O)c3ccc(Cl)cc3)c2)n1
InChI Key InChIKey=SJCMGUWYFGRDHY-UHFFFAOYSA-N
Data  1 EC50
  Tab Delimited (TSV)   2D SDfile   Computed 3D by Vconf -m prep SDfile
Find this compound or compounds like it in BindingDB:
Activity Spreadsheet -- Enzyme Inhibition Constant Data from BindingDB
Found 1 hit for monomerid = 50435647
TargetGlucose-dependent insulinotropic receptor(Homo sapiens (Human))
Amgen
Curated by ChEMBL
LigandPNGBDBM50435647(CHEMBL2391434)
Affinity DataEC50:  350nM. Assay description: Agonist activity at human GPR119 expressed in HEK293 cells assessed as cAMP accumulation after 30 mins
In DepthDetails ArticlePubMed