BDBM50435655 CHEMBL2391612
SMILES Cc1ccc(C#N)c(Oc2cccc(NS(=O)(=O)c3ccc(Cl)cc3)c2)n1
InChI Key InChIKey=MUCQJIYWCFSWJY-UHFFFAOYSA-N
Data  1 EC50
  Tab Delimited (TSV)   2D SDfile   Computed 3D by Vconf -m prep SDfile
Find this compound or compounds like it in BindingDB:
Activity Spreadsheet -- Enzyme Inhibition Constant Data from BindingDB
Found 1 hit for monomerid = 50435655
TargetGlucose-dependent insulinotropic receptor(Homo sapiens (Human))
Amgen
Curated by ChEMBL
LigandPNGBDBM50435655(CHEMBL2391612)
Affinity DataEC50:  1.71E+3nM. Assay description: Agonist activity at human GPR119 expressed in HEK293 cells assessed as cAMP accumulation after 30 mins
In DepthDetails ArticlePubMed