BDBM50435742 CHEMBL2392709
SMILES CNc1nc(C)nc(n1)N1CCC(CC1)C(=O)NCc1cccc(OC(F)(F)F)c1
InChI Key InChIKey=JGRJKDQTCBELIZ-UHFFFAOYSA-N
Data  2 IC50
  Tab Delimited (TSV)   2D SDfile   Computed 3D by Vconf -m prep SDfile
Find this compound or compounds like it in BindingDB:
Activity Spreadsheet -- Enzyme Inhibition Constant Data from BindingDB
Found 2 hits for monomerid = 50435742
TargetCytochrome P450 2C9(Homo sapiens (Human))
Glaxosmithkline
Curated by ChEMBL
LigandPNGBDBM50435742(CHEMBL2392709)
Affinity DataIC50: >2.50E+4nM. Assay description: Inhibition of CYP2C9 (unknown origin)
In DepthDetails ArticlePubMed
TargetBifunctional epoxide hydrolase 2(Homo sapiens (Human))
Glaxosmithkline
Curated by ChEMBL
LigandPNGBDBM50435742(CHEMBL2392709)
Affinity DataIC50:  630nM. Assay description: Inhibition of human soluble epoxide hydrolase using PHOME as substrate assessed as formation of 6-methoxy-2-naphthaldehyde incubated for 10 mins prio...
In DepthDetails ArticlePubMed