BDBM50435872 CHEMBL2391071
SMILES Ic1cccc(CS(=O)(=O)N2CCC(Cc3ccccc3)CC2)c1
InChI Key InChIKey=ZHAFILXCNOYRFH-UHFFFAOYSA-N
Data  1 KI
  Tab Delimited (TSV)   2D SDfile   Computed 3D by Vconf -m prep SDfile
Find this compound or compounds like it in BindingDB:
Activity Spreadsheet -- Enzyme Inhibition Constant Data from BindingDB
Found 1 hit for monomerid = 50435872
TargetSigma non-opioid intracellular receptor 1(Cavia porcellus (Guinea pig))
Nstri
Curated by ChEMBL
LigandPNGBDBM50435872(CHEMBL2391071)
Affinity DataKi:  0.960nM. Assay description: Displacement of [3H](+)pentazocine from sigma1 receptor in Dunkin Hartley guinea pig brain membrane after 120 mins by liquid scintillation counting a...
In DepthDetails ArticlePubMed