BDBM50435900 CHEMBL2391443
SMILES Cc1cc(Cc2cccc(Cl)c2)c(=O)n(CC(=O)Nc2ccc(I)cc2)n1
InChI Key InChIKey=PSLAZNCKJKOLBS-UHFFFAOYSA-N
Data  1 EC50
  Tab Delimited (TSV)   2D SDfile   Computed 3D by Vconf -m prep SDfile
Find this compound or compounds like it in BindingDB:
Activity Spreadsheet -- Enzyme Inhibition Constant Data from BindingDB
Found 1 hit for monomerid = 50435900
TargetN-formyl peptide receptor 3(Homo sapiens (Human))
Universit£
Curated by ChEMBL
LigandPNGBDBM50435900(CHEMBL2391443)
Affinity DataEC50: >5.00E+4nM. Assay description: Agonist activity at FPR3 (unknown origin) transfected in human HL60 cells assessed as induction of Ca2+ mobilization
In DepthDetails ArticlePubMed