BDBM50435932 CHEMBL2391260
SMILES COc1cccc(Cc2cc(nn(CC(=O)Nc3ccc(F)cc3)c2=O)-c2ccccc2)c1
InChI Key InChIKey=ZKWLOPBDSPJHCJ-UHFFFAOYSA-N
Data  1 EC50
  Tab Delimited (TSV)   2D SDfile   Computed 3D by Vconf -m prep SDfile
Find this compound or compounds like it in BindingDB:
Activity Spreadsheet -- Enzyme Inhibition Constant Data from BindingDB
Found 1 hit for monomerid = 50435932
TargetN-formyl peptide receptor 3(Homo sapiens (Human))
Universit£
Curated by ChEMBL
LigandPNGBDBM50435932(CHEMBL2391260)
Affinity DataEC50: >5.00E+4nM. Assay description: Agonist activity at FPR3 (unknown origin) transfected in human HL60 cells assessed as induction of Ca2+ mobilization
In DepthDetails ArticlePubMed