BDBM50436682 CHEMBL2396674
SMILES CC(C)(C)C[C@@H]1N[C@H]([C@H](c2cccc(Cl)c2F)[C@]11C(=O)Nc2cc(Cl)ccc12)C(=O)N[C@H]1C[C@@](C)(O)C1
InChI Key InChIKey=MZBOZBMARIQZGX-GRRGFIRHSA-N
Data  2 KI  1 IC50
  Tab Delimited (TSV)   2D SDfile   Computed 3D by Vconf -m prep SDfile
Find this compound or compounds like it in BindingDB:
Activity Spreadsheet -- Enzyme Inhibition Constant Data from BindingDB
Found 3 hits for monomerid = 50436682
TargetE3 ubiquitin-protein ligase Mdm2(Homo sapiens (Human))
University Of Michigan
Curated by ChEMBL
LigandPNGBDBM50436682(CHEMBL2396674)
Affinity DataKi:  0.440nM. Assay description: Binding affinity to recombinant human His-tagged MDM2 (1 to 118 amino acids) using p53-based PMDM6-F as probe after 15 mins by competition assay
In DepthDetails ArticlePubMed
TargetE3 ubiquitin-protein ligase Mdm2(Homo sapiens (Human))
University Of Michigan
Curated by ChEMBL
LigandPNGBDBM50436682(CHEMBL2396674)
Affinity DataKi:  0.440nM. Assay description: Binding affinity to human recombinant his-tagged MDM2 assessed as inhibition constant by fluorescence polarization based assay
In DepthDetails PubMed
TargetE3 ubiquitin-protein ligase Mdm2(Homo sapiens (Human))
University Of Michigan
Curated by ChEMBL
LigandPNGBDBM50436682(CHEMBL2396674)
Affinity DataIC50:  6.80nM. Assay description: Binding affinity to recombinant human His-tagged MDM2 (1 to 118 amino acids) using p53-based PMDM6-F as probe after 15 to 30 mins by fluorescence pol...
In DepthDetails ArticlePubMed