BDBM50436737 CHEMBL2401974
SMILES CCC1N(c2ccccc2)c2nc(ncc2N(C)C1=O)-n1ccnc1-c1ccccc1
InChI Key InChIKey=ZJJBLPXVAOPPAR-UHFFFAOYSA-N
Data  2 IC50
  Tab Delimited (TSV)   2D SDfile   Computed 3D by Vconf -m prep SDfile
Find this compound or compounds like it in BindingDB:
Activity Spreadsheet -- Enzyme Inhibition Constant Data from BindingDB
Found 2 hits for monomerid = 50436737
TargetSerine/threonine-protein kinase PLK2(Homo sapiens (Human))
Elan Pharmaceuticals
Curated by ChEMBL
LigandPNGBDBM50436737(CHEMBL2401974)
Affinity DataIC50:  17nM. Assay description: Inhibition of GST-tagged Plk2 (unknown origin) assessed as inhibition of DEKTDDED phosphorylation at Thr1342 after 60 mins by TR-FRET assay
In DepthDetails ArticlePubMed
TargetSerine/threonine-protein kinase PLK1(Homo sapiens (Human))
Elan Pharmaceuticals
Curated by ChEMBL
LigandPNGBDBM50436737(CHEMBL2401974)
Affinity DataIC50:  2.83E+3nM. Assay description: Inhibition of GST-tagged Plk1 (unknown origin) assessed as inhibition of DEKTDDED phosphorylation at Thr1342 after 60 mins by TR-FRET assay
In DepthDetails ArticlePubMed