BDBM50436747 CHEMBL2401968
SMILES CCC1N(C2CCC(F)(F)C2)c2nc(ncc2N(C)C1=O)-n1ccnc1-c1ccc(F)cc1
InChI Key InChIKey=RHIJMDNVEPLDED-UHFFFAOYSA-N
Data  2 IC50
  Tab Delimited (TSV)   2D SDfile   Computed 3D by Vconf -m prep SDfile
Find this compound or compounds like it in BindingDB:
Activity Spreadsheet -- Enzyme Inhibition Constant Data from BindingDB
Found 2 hits for monomerid = 50436747
TargetSerine/threonine-protein kinase PLK2(Homo sapiens (Human))
Elan Pharmaceuticals
Curated by ChEMBL
LigandPNGBDBM50436747(CHEMBL2401968)
Affinity DataIC50:  13nM. Assay description: Inhibition of GST-tagged Plk2 (unknown origin) assessed as inhibition of DEKTDDED phosphorylation at Thr1342 after 60 mins by TR-FRET assay
In DepthDetails ArticlePubMed
TargetSerine/threonine-protein kinase PLK1(Homo sapiens (Human))
Elan Pharmaceuticals
Curated by ChEMBL
LigandPNGBDBM50436747(CHEMBL2401968)
Affinity DataIC50:  320nM. Assay description: Inhibition of GST-tagged Plk1 (unknown origin) assessed as inhibition of DEKTDDED phosphorylation at Thr1342 after 60 mins by TR-FRET assay
In DepthDetails ArticlePubMed