BDBM50436748 CHEMBL2402083
SMILES CC[C@H]1N(C2CCOCC2)c2nc(ncc2N(C)C1=O)-c1c[nH]nc1-c1nccs1
InChI Key InChIKey=NILXCNICWMPUMM-CQSZACIVSA-N
Data  3 IC50
  Tab Delimited (TSV)   2D SDfile   Computed 3D by Vconf -m prep SDfile
Find this compound or compounds like it in BindingDB:
Activity Spreadsheet -- Enzyme Inhibition Constant Data from BindingDB
Found 3 hits for monomerid = 50436748
TargetSerine/threonine-protein kinase PLK2(Homo sapiens (Human))
Elan Pharmaceuticals
Curated by ChEMBL
LigandPNGBDBM50436748(CHEMBL2402083)
Affinity DataIC50:  2.99E+3nM. Assay description: Inhibition of Plk2 (unknown origin) transfected in HEK293 cells assessed as inhibition of alpha-synuclein phosphorylation at ser129 after 2 hrs by EL...
In DepthDetails ArticlePubMed
TargetSerine/threonine-protein kinase PLK2(Homo sapiens (Human))
Elan Pharmaceuticals
Curated by ChEMBL
LigandPNGBDBM50436748(CHEMBL2402083)
Affinity DataIC50:  36nM. Assay description: Inhibition of GST-tagged Plk2 (unknown origin) assessed as inhibition of DEKTDDED phosphorylation at Thr1342 after 60 mins by TR-FRET assay
In DepthDetails ArticlePubMed
TargetSerine/threonine-protein kinase PLK1(Homo sapiens (Human))
Elan Pharmaceuticals
Curated by ChEMBL
LigandPNGBDBM50436748(CHEMBL2402083)
Affinity DataIC50:  250nM. Assay description: Inhibition of GST-tagged Plk1 (unknown origin) assessed as inhibition of DEKTDDED phosphorylation at Thr1342 after 60 mins by TR-FRET assay
In DepthDetails ArticlePubMed