BDBM50436889 CHEMBL1627154
SMILES CN[C@@H](C)C(=O)N[C@@H](C(C)C)C(=O)N[C@@H](CCCNC(N)=N[N+]([O-])=O)C(=O)NNc1ccccc1
InChI Key InChIKey=NUANDDLZGWEIRT-XIRDDKMYSA-N
Data  2 KI
  Tab Delimited (TSV)   2D SDfile   Computed 3D by Vconf -m prep SDfile
Find this compound or compounds like it in BindingDB:
Activity Spreadsheet -- Enzyme Inhibition Constant Data from BindingDB
Found 2 hits for monomerid = 50436889
TargetE3 ubiquitin-protein ligase XIAP(Homo sapiens (Human))
Sanford-Burnham Medical Research Institute
Curated by ChEMBL
LigandPNGBDBM50436889(CHEMBL1627154)
Affinity DataKi:  1.18E+3nM. Assay description: Competitive inhibition of XIAP-BIR2 domain (unknown origin) by fluorescence polarization assay
In DepthDetails ArticlePubMed
TargetE3 ubiquitin-protein ligase XIAP(Homo sapiens (Human))
Sanford-Burnham Medical Research Institute
Curated by ChEMBL
LigandPNGBDBM50436889(CHEMBL1627154)
Affinity DataKi:  8.79E+3nM. Assay description: Competitive inhibition of XIAP-BIR3 domain (unknown origin) by fluorescence polarization assay
In DepthDetails ArticlePubMed