BDBM50436903 CHEMBL2401860
SMILES CC(C)(C)c1ccccc1Oc1ncccc1Nc1nc(c(s1)-c1ccc(OC(F)(F)F)cc1)C(F)(F)F
InChI Key InChIKey=PJQAVAOCYJGQHU-UHFFFAOYSA-N
Data  2 KI
  Tab Delimited (TSV)   2D SDfile   Computed 3D by Vconf -m prep SDfile
Find this compound or compounds like it in BindingDB:
Activity Spreadsheet -- Enzyme Inhibition Constant Data from BindingDB
Found 2 hits for monomerid = 50436903
TargetP2Y purinoceptor 1(Homo sapiens (Human))
Bristol-Myers Squibb
Curated by ChEMBL
LigandPNGBDBM50436903(CHEMBL2401860)
Affinity DataKi:  12nM. Assay description: Displacement of [beta-33P]-2MeS-ADP from human P2Y1 receptor expressed in HEK293 cells after 1 hr by scintillation counting analysis
In DepthDetails ArticlePubMed
TargetP2Y purinoceptor 1(Homo sapiens (Human))
Bristol-Myers Squibb
Curated by ChEMBL
LigandPNGBDBM50436903(CHEMBL2401860)
Affinity DataKi:  12nM. Assay description: Displacement of [beta-33P]-2MeS-ADP from human P2Y1 expressed in HEK293 cells after 1 hr by scintillation counting analysis
In DepthDetails ArticlePubMed