BDBM50437566 CHEMBL2407660
SMILES C[C@@H](N1C(=O)N[C@](Cc2ccccc2)(C(=O)N2CCc3ccccc3C2)C1=O)c1ccccc1
InChI Key InChIKey=KGKCCVMCOIHHNJ-PIIWDFAUSA-N
Data  1 IC50
  Tab Delimited (TSV)   2D SDfile   Computed 3D by Vconf -m prep SDfile
Find this compound or compounds like it in BindingDB:
Activity Spreadsheet -- Enzyme Inhibition Constant Data from BindingDB
Found 1 hit for monomerid = 50437566
TargetMineralocorticoid receptor(Homo sapiens (Human))
Merck Research Laboratories
Curated by ChEMBL
LigandPNGBDBM50437566(CHEMBL2407660)
Affinity DataIC50:  990nM. Assay description: Antagonist activity at human mineralocorticoid receptor assessed as inhibition of binding to coactivator peptide by NH Pro assay
In DepthDetails ArticlePubMed