BDBM50437577 CHEMBL2407648
SMILES COc1cc(CNC(=O)[C@@]2(Cc3ccccc3)OC(=O)N(C3CCCc4ccccc34)C2=O)cc(OC)c1
InChI Key InChIKey=BJIJYPHJHHHWTD-NPRFROTHSA-N
Data  1 IC50
  Tab Delimited (TSV)   2D SDfile   Computed 3D by Vconf -m prep SDfile
Find this compound or compounds like it in BindingDB:
Activity Spreadsheet -- Enzyme Inhibition Constant Data from BindingDB
Found 1 hit for monomerid = 50437577
TargetMineralocorticoid receptor(Homo sapiens (Human))
Merck Research Laboratories
Curated by ChEMBL
LigandPNGBDBM50437577(CHEMBL2407648)
Affinity DataIC50:  170nM. Assay description: Antagonist activity at human mineralocorticoid receptor assessed as inhibition of binding to coactivator peptide by NH Pro assay
In DepthDetails ArticlePubMed