BDBM50437618 CHEMBL2407681
SMILES C[C@@H](N1C(=O)O[C@](Cc2ccccc2)(C(=O)Nc2ccccc2Cl)C1=O)c1ccccc1
InChI Key InChIKey=NHXHKDLNCSLLNV-CRICUBBOSA-N
Data  1 IC50
  Tab Delimited (TSV)   2D SDfile   Computed 3D by Vconf -m prep SDfile
Find this compound or compounds like it in BindingDB:
Activity Spreadsheet -- Enzyme Inhibition Constant Data from BindingDB
Found 1 hit for monomerid = 50437618
TargetMineralocorticoid receptor(Homo sapiens (Human))
Merck Research Laboratories
Curated by ChEMBL
LigandPNGBDBM50437618(CHEMBL2407681)
Affinity DataIC50:  1.00E+3nM. Assay description: Antagonist activity at human mineralocorticoid receptor assessed as inhibition of binding to coactivator peptide by NH Pro assay
In DepthDetails ArticlePubMed