BDBM50437625 CHEMBL2407674
SMILES C[C@@H](N1C(=O)O[C@](Cc2ccccc2)(C(=O)NCc2cccc(c2)C(F)(F)F)C1=O)c1ccccc1
InChI Key InChIKey=BGDUVPYBMURKBO-WXTAPIANSA-N
Data  1 IC50
  Tab Delimited (TSV)   2D SDfile   Computed 3D by Vconf -m prep SDfile
Find this compound or compounds like it in BindingDB:
Activity Spreadsheet -- Enzyme Inhibition Constant Data from BindingDB
Found 1 hit for monomerid = 50437625
TargetMineralocorticoid receptor(Homo sapiens (Human))
Merck Research Laboratories
Curated by ChEMBL
LigandPNGBDBM50437625(CHEMBL2407674)
Affinity DataIC50:  500nM. Assay description: Antagonist activity at human mineralocorticoid receptor assessed as inhibition of binding to coactivator peptide by NH Pro assay
In DepthDetails ArticlePubMed