BDBM50437632 CHEMBL2407667
SMILES COc1cc(CNC(=O)[C@@]2(Cc3ccccc3)OC(=O)N(Cc3ccccc3)C2=O)cc(OC)c1
InChI Key InChIKey=ARTSOPNFUGOZHC-HHHXNRCGSA-N
Data  1 IC50
  Tab Delimited (TSV)   2D SDfile   Computed 3D by Vconf -m prep SDfile
Find this compound or compounds like it in BindingDB:
Activity Spreadsheet -- Enzyme Inhibition Constant Data from BindingDB
Found 1 hit for monomerid = 50437632
TargetMineralocorticoid receptor(Homo sapiens (Human))
Merck Research Laboratories
Curated by ChEMBL
LigandPNGBDBM50437632(CHEMBL2407667)
Affinity DataIC50:  3.00E+3nM. Assay description: Antagonist activity at human mineralocorticoid receptor assessed as inhibition of binding to coactivator peptide by NH Pro assay
In DepthDetails ArticlePubMed