BDBM50437717 CHEMBL2407114
SMILES Nc1cccc2C[C@@H](O)[C@@H](Cc12)N1CCC(CC1)C(=O)c1cccnc1
InChI Key InChIKey=DLTBIZOFLFQWQP-WOJBJXKFSA-N
Data  2 KI
  Tab Delimited (TSV)   2D SDfile   Computed 3D by Vconf -m prep SDfile
Find this compound or compounds like it in BindingDB:
Activity Spreadsheet -- Enzyme Inhibition Constant Data from BindingDB
Found 2 hits for monomerid = 50437717
TargetVesicular acetylcholine transporter(Homo sapiens (Human))
Washington University
Curated by ChEMBL
LigandPNGBDBM50437717(CHEMBL2407114)
Affinity DataKi:  118nM. Assay description: Displacement of (-)-[3H]vesamicol from human VAChT expressed in rat PC12 cell membrane after 20 hrs
In DepthDetails ArticlePubMed
TargetSigma non-opioid intracellular receptor 1(Cavia porcellus (Guinea pig))
Washington University
Curated by ChEMBL
LigandPNGBDBM50437717(CHEMBL2407114)
Affinity DataKi:  2.03E+4nM. Assay description: Displacement of (+)- [3H]pentazocine from sigma 1 receptor expressed in guinea pig brain membrane homogenates by scintillation counting analysis
In DepthDetails ArticlePubMed